�ΏێҔԍ�,2016�N�N��,2016�N������L,2017�N������L,2018�N������L,����,2018�N�����Q��,2016�N�L������,2018�N�L������,2016�N1�����ϕ���,2018�N1�����ϕ���,2016�N��������p�p�x,2018�N��������p�p�x,2016�N��Ô�,2017�N��Ô�,2016�N�v�x�����,2016�N���s�⏕,2018�N�v�x�����,2018�N���s�⏕
2,65,0,,,0,0,0,,,,0,0,,,,,,
3,79,0,,,0,0,0,,,,0,0,,,0,0,,
4,67,0,0,0,1,0,28,,3555,,0,0,,,,,0,0
5,73,1,1,1,1,1,0,9,,11524,0,0,,,0,0,0,0
6,73,0,0,0,0,0,6,,,,0,0,212695,228580,0,0,0,0
7,69,1,1,1,1,1,4,1,,,3,2,97430,70970,0,0,,
8,73,0,0,0,0,0,0,,,,0,0,,,0,0,0,0
9,68,0,0,0,0,0,18,,855,,0,0,,,0,0,,
10,74,0,0,0,1,0,7,,2264,,0,0,2304600,664460,,,,0
11,69,1,1,1,0,0,2,,,,6,8,,,0,0,0,0
12,78,1,1,1,0,1,9,7,3518,4330,3,8,,,,,0,0
13,84,1,0,0,1,1,14,0,564,,0,0,688005,845460,1,0,1,0
14,81,1,1,1,1,0,4,,,,1,14,,,1,1,,
15,71,1,1,1,0,1,0,11,,7646,14,10,173610,167920,0,0,0,0
16,72,1,1,1,1,0,0,,,,5,0,240790,250900,0,0,0,0
17,65,0,0,0,1,0,24,,3371,,0,0,,,0,0,0,0
18,71,1,1,1,1,1,7,9,6202,3651,5,2,,,0,0,0,0
19,71,0,0,0,1,1,0,10,,7191,0,0,0,81640,0,0,0,0
20,68,1,1,1,1,1,8,3,4460,2351,0,2,168540,295860,0,0,0,0
21,73,1,1,1,1,0,12,,6039,,15,14,,,,,,
22,75,0,0,0,1,0,20,,6684,,0,0,,,0,0,0,0
23,74,1,1,0,1,1,11,5,2029,5448,0,0,111270,987020,0,0,0,0
24,73,1,1,1,0,1,9,7,2499,3499,0,4,568480,646630,0,0,0,1
25,85,1,,,1,0,6,,,,1,0,,,1,0,,
28,96,0,0,0,0,0,0,,,,0,0,,,,1,1,1
29,71,0,0,0,0,0,1,,,,0,0,177360,221380,,0,0,0
30,76,1,1,1,0,0,0,,,,5,0,472310,200060,,0,0,0
31,79,1,1,1,1,0,19,,508,,1,0,901408,833356,,,1,1
32,82,1,1,1,0,1,11,9,5236,6791,9,2,267880,234150,1,0,1,0
33,75,1,1,1,1,0,27,,20925,,0,0,,,0,0,,
34,80,1,1,1,1,1,5,13,,10812,4,0,851190,1000630,0,0,0,0
35,77,0,0,0,0,0,0,,,,0,0,,,0,0,0,0
36,76,1,1,1,1,0,7,,773,,0,2,,,,,,
37,73,1,1,1,0,1,24,3,8093,4071,2,0,93510,113520,0,0,0,0
40,72,0,0,0,1,1,2,4,,2705,0,0,122180,171390,0,0,0,0
41,70,0,0,0,1,0,0,,,,0,0,,,0,0,,
42,85,0,0,0,1,0,1,,,,0,0,,,0,0,0,0
43,75,1,1,1,1,0,6,,,,0,0,,,1,1,,
44,70,1,1,1,1,0,23,,7337,,1,0,,,1,0,1,0
45,74,1,1,1,0,1,2,3,,3961,2,18,327660,313690,,,0,0
46,69,1,1,1,1,1,19,5,5060,3530,0,4,13010,78300,0,0,0,0
47,72,0,1,1,1,1,8,1,4539,,0,6,784180,735550,0,0,0,0
48,67,1,1,1,1,1,19,9,10311,7661,2,0,76850,95800,0,0,0,0
49,80,1,0,0,1,0,9,,3904,,0,0,,,0,0,,
50,84,1,1,1,1,1,14,6,192,959,0,2,392250,599510,0,1,0,1
52,86,1,1,1,1,0,0,,,,1,0,23400,81980,0,0,0,0
53,84,1,1,1,0,1,0,0,,,11,8,277170,210690,0,1,0,1
54,73,1,1,0,1,0,0,,,,0,0,220900,158280,,,0,0
55,73,0,0,0,0,0,7,,5863,,0,0,,,0,0,,
56,77,0,,,1,0,0,,,,0,0,,,,,,
57,81,1,1,1,0,0,0,,,,7,2,,,0,0,1,0
58,69,1,1,1,1,0,22,,10596,,4,0,,,0,0,0,0
60,78,0,,,1,0,0,,,,0,0,,,,,,
61,73,0,0,1,1,0,9,,6384,,0,0,,,0,0,0,0
63,80,1,1,1,1,1,0,3,,5908,9,10,652770,569000,0,0,0,0
65,82,1,1,1,1,0,0,,,,25,26,,,0,0,0,0
66,80,1,1,1,0,0,0,,,,0,0,125950,226305,,,0,0
67,79,0,1,1,0,1,2,5,,3558,0,2,421010,349020,,,0,0
68,76,1,1,1,1,1,0,4,,5631,11,8,225820,224790,,,0,0
69,77,1,1,1,1,1,16,7,5133,3101,0,2,647160,769840,0,0,0,0
70,73,1,1,1,0,1,16,0,1831,,0,0,401230,375940,0,0,0,0
71,74,1,1,1,1,1,26,11,7512,10706,4,4,658630,485880,0,0,0,0
72,75,1,1,1,1,0,0,,,,7,4,,,,,0,0
73,72,1,1,0,1,1,16,6,5095,3716,1,0,165180,194994,0,0,0,0
74,66,1,1,1,1,1,0,15,,21293,0,0,3079950,584630,0,0,0,0
75,66,0,,,1,0,0,,,,0,0,,,0,0,,
76,67,0,0,0,1,0,6,,,,0,0,,,0,0,,
77,80,0,0,0,0,1,0,2,,,0,0,342130,655940,,,0,0
78,79,1,1,1,1,1,14,0,3068,,0,0,406365,1739510,0,0,0,0
79,78,1,1,1,1,1,0,6,,12457,12,22,415780,201790,0,0,0,0
81,81,1,1,1,0,0,4,,,,1,0,,,0,0,0,0
82,73,1,1,1,0,0,0,,,,2,6,,,0,0,,
83,83,1,1,1,0,0,7,,5641,,0,0,,,0,0,,
84,65,0,0,0,1,0,0,,,,0,0,,,0,0,,
85,80,1,1,1,0,0,10,,884,,2,2,,,0,0,0,0
86,81,1,1,1,1,0,21,,4900,,4,0,,,0,,0,0
87,74,1,1,1,0,0,17,,1036,,0,0,,,,,,
88,82,1,1,1,1,0,0,,,,1,0,,,0,1,0,1
89,82,1,1,1,1,1,9,0,3697,,3,0,,,,,0,0
90,79,0,0,0,1,1,0,4,,3114,0,0,,,0,0,0,0
91,86,1,1,1,1,0,11,,620,,2,2,303140,285320,,,0,1
92,72,1,1,1,0,0,0,,,,7,0,,,0,0,1,0
93,83,0,0,0,1,0,17,,1080,,0,0,624625,699683,0,0,0,0
95,68,1,1,1,1,1,19,9,14247,13524,0,0,227030,119995,,,0,0
96,78,1,1,1,0,1,19,14,408,367,2,0,1118160,445480,1,1,1,1
97,70,1,1,1,1,1,0,9,,6520,0,0,358130,264400,0,0,0,0
98,80,0,0,0,1,0,9,,2443,,0,0,,,,0,,
99,77,1,1,1,1,0,0,,,,1,0,,,0,0,,
100,75,1,1,1,0,1,21,7,5809,6169,6,4,275890,338810,0,0,0,1
101,73,1,1,1,1,0,13,,2356,,5,8,271220,220340,0,0,0,0
102,74,0,0,0,1,1,18,2,6230,,0,0,61060,95410,0,0,0,0
103,68,0,0,1,1,1,0,8,,5268,0,6,,,0,0,0,0
104,73,0,0,0,0,0,24,,1546,,0,0,,,0,1,0,1
105,69,1,1,1,1,1,28,13,8966,8790,2,0,173930,182960,0,0,0,0
106,74,0,0,0,0,1,11,8,1641,900,0,0,,,0,0,0,0
107,88,1,1,1,0,0,11,,116,,6,0,,,0,1,,
108,79,1,1,1,1,0,0,,,,1,0,,,0,0,,
109,85,1,1,1,1,1,19,6,1907,1240,4,6,666790,201390,0,0,0,0
110,71,0,0,0,1,1,17,3,5399,4911,0,0,67370,96610,0,0,0,0
113,78,0,0,0,1,1,4,9,,1961,0,0,10899830,11907320,0,0,0,0
114,95,0,,,1,0,14,,156,,0,0,,,1,1,,
115,78,0,0,0,1,0,15,,7166,,0,0,,,0,0,0,0
116,65,0,0,0,1,1,5,0,,,0,0,,,0,0,0,0
117,78,0,,,1,0,2,,,,0,0,,,,,,
118,80,1,1,1,0,1,5,2,,,2,0,196330,446070,0,0,0,1
119,84,1,1,1,1,0,27,,2200,,1,0,,,0,0,0,1
121,90,0,,,0,0,27,,348,,0,0,,,1,1,,
122,73,0,0,0,1,1,25,15,969,628,0,0,,,,,0,0
123,69,1,1,1,0,1,3,1,,,4,12,,,,,0,0
124,68,0,0,0,1,1,20,0,3625,,0,0,,,0,0,,
125,81,1,1,1,0,0,0,,,,5,6,,,,,0,0
126,70,0,0,0,0,0,7,,3923,,0,0,,,0,0,0,0
128,74,0,0,0,0,0,12,,8679,,0,0,,,0,0,0,0
129,75,1,1,1,1,0,7,,8028,,1,4,,,0,0,,
130,70,0,0,0,0,1,17,3,12317,11714,0,0,66310,74380,,,0,0
131,68,0,0,0,1,1,17,4,2638,2161,0,0,189480,17490,0,0,0,0
132,87,1,1,1,1,1,27,6,3106,1923,1,0,437770,423390,0,0,0,0
133,69,0,0,0,1,1,10,0,2545,,0,0,,,0,0,0,0
134,69,0,0,0,1,1,13,3,3631,4411,0,0,,,0,0,0,0
135,74,0,0,0,1,0,16,,6315,,0,0,,,0,0,0,0
136,68,1,0,0,1,0,8,,1766,,0,0,,,0,0,,
137,80,1,,,1,0,10,,7100,,5,0,,,,,,
138,86,0,0,0,1,0,11,,3181,,0,0,,,0,0,,
139,76,1,1,1,1,0,17,,1040,,7,0,,,0,0,,
140,94,0,1,0,0,0,0,,,,0,0,,,1,1,,
141,78,0,0,0,1,0,0,,,,0,0,,,,,,
142,77,1,1,1,0,1,15,0,5936,,12,14,189160,216450,0,0,0,0
143,82,0,,,1,0,0,,,,0,0,,,,,,
144,85,1,1,1,0,0,12,,3924,,4,0,,,0,0,1,1
145,85,1,1,1,1,0,0,,,,13,4,,,,,0,0
146,75,1,1,1,1,0,22,,3153,,0,0,364810,187490,0,0,0,0
147,72,0,0,0,1,0,0,,,,0,0,,,0,0,,
148,80,1,1,1,0,1,0,0,,,29,28,260036,209278,,,0,0
149,68,0,0,0,0,1,22,5,2575,1607,0,0,431180,492890,,,0,0
151,79,1,1,1,0,1,24,2,3840,,3,2,350040,844190,0,0,0,0
152,94,0,0,0,1,0,0,,,,0,0,,,1,1,1,1
154,73,0,0,0,1,1,0,14,,13056,0,0,445195,373020,0,0,0,0
155,72,0,0,0,0,1,6,5,,8623,0,0,259370,406570,0,0,0,0
156,82,1,1,1,1,1,7,2,2965,,9,6,148400,275665,0,0,0,0
158,67,0,0,0,1,1,11,1,4038,,0,0,263280,223150,0,0,0,0
159,74,1,1,1,1,1,0,7,,3513,0,0,296140,697970,0,0,0,0
160,88,1,1,1,1,1,0,0,,,1,0,2815390,3770180,0,0,0,0
161,74,1,1,1,1,1,0,1,,,1,0,122350,137950,0,0,0,0
162,72,1,1,1,1,1,0,10,,11749,0,0,134760,170430,0,0,0,0
163,88,0,0,0,1,1,18,0,336,,0,0,269160,344170,0,0,0,0
164,79,1,1,1,0,1,0,4,,2059,2,4,730950,344950,0,0,0,1
165,74,0,0,0,1,1,0,9,,442,0,0,1850961,878560,,,0,0
166,72,1,1,1,1,0,0,,,,1,6,,,0,0,0,0
167,69,1,1,1,0,0,21,,1816,,0,0,,,0,0,0,0
168,85,0,0,0,1,0,0,,,,0,0,,,0,0,,
169,82,1,1,1,0,0,8,,1769,,6,2,2438464,221490,,,1,0
170,69,0,0,0,0,0,0,,,,0,0,,,1,1,,
171,74,0,0,0,0,1,0,7,,2954,0,0,257610,455600,0,0,0,0
172,81,0,0,0,1,1,3,4,,1815,0,0,2013860,2071990,0,0,0,0
173,71,1,1,1,1,1,13,1,5884,,0,0,320310,270730,0,0,0,0
175,79,1,1,1,0,0,0,,,,6,8,,,0,0,,
177,72,1,1,1,0,0,2,,,,22,22,,,0,0,,
178,75,1,1,1,1,1,0,14,,6642,4,6,185350,350610,0,0,0,0
180,80,1,1,1,1,1,25,6,3182,4199,0,10,625710,700840,,,0,0
181,82,0,0,0,1,1,0,12,,3582,0,0,552100,521690,1,0,1,0
182,69,1,1,1,0,1,1,3,,2298,0,0,398360,630550,0,0,0,0
183,69,1,1,1,1,0,0,,,,0,2,,,,,0,0
184,77,1,1,0,1,0,18,,5068,,0,0,413200,4803930,,,0,0
185,85,0,,,1,0,4,,,,0,0,,,0,0,,
186,71,0,0,0,1,1,19,1,1782,,0,0,49810,33160,0,0,0,0
188,85,1,1,1,0,0,15,,6584,,1,0,,,0,0,0,0
189,78,1,1,1,0,0,18,,1390,,4,2,364770,152050,0,0,0,0
190,69,0,0,0,0,0,0,,,,0,0,,,0,0,0,0
191,79,1,,,0,0,7,,4595,,0,0,,,,,,
192,91,0,0,0,1,0,30,,7379,,0,0,,,0,0,,
193,74,0,0,0,0,1,16,4,653,851,0,0,,,0,0,0,0
194,79,1,1,1,1,0,0,,,,0,2,1259443,1253221,1,1,0,1
195,81,1,1,1,0,1,27,7,1292,1599,1,0,313220,413310,,,0,0
196,80,1,1,1,1,1,20,12,4709,5564,0,0,277540,238140,0,0,0,0
197,76,1,1,1,0,0,0,,,,2,0,1272130,27300,0,0,,
198,73,0,0,0,0,0,0,,,,0,0,,,0,0,,
199,70,1,1,1,1,0,2,,,,0,2,,,,,,
201,72,0,,,0,0,0,,,,0,0,,,,,,
202,80,1,1,1,1,1,0,5,,4406,0,2,342615,274795,0,0,0,0
203,83,1,1,1,1,0,8,,3936,,1,0,,,0,0,,
205,69,0,,,0,0,11,,3286,,0,0,,,,,,
206,81,1,1,1,1,0,28,,869,,0,0,,,,,,1
207,73,1,0,0,1,0,21,,2657,,0,0,,,,,,1
208,69,0,,,0,0,0,,,,0,0,,,,,,
209,77,0,,,1,0,0,,,,0,0,,,,,,
210,75,1,1,1,0,1,14,4,8328,4251,1,2,,,0,0,0,0
211,71,0,0,0,1,0,20,,490,,0,0,,,,,,
212,75,0,0,0,1,1,11,3,6666,2357,0,0,273070,1044600,,,0,0
213,75,1,1,1,1,1,10,7,4400,5086,3,0,242670,279530,,,0,0
214,71,0,0,0,1,1,0,7,,11648,0,0,447200,367580,0,0,0,0
215,65,0,0,0,0,1,4,1,,,0,0,379450,82350,0,0,0,0
216,69,0,0,0,0,0,9,,1939,,0,0,,,0,0,0,0
217,81,1,1,1,1,0,30,,8219,,4,2,,,,,,
218,71,1,1,1,1,1,15,2,2000,,2,0,,,0,0,0,0
219,74,0,0,0,1,0,16,,5462,,0,0,,,,,,
220,69,0,0,0,0,0,4,,,,0,0,,,0,0,,
221,71,1,1,1,1,1,0,3,,996,1,2,2194430,392480,0,0,0,0
222,82,1,1,1,1,0,13,,3657,,4,0,,,,,0,1
223,72,1,1,1,1,1,10,5,2666,6882,5,6,82390,98130,,,0,0
224,66,1,1,1,1,0,11,,9694,,0,0,,,0,0,,
225,66,1,1,1,1,1,11,5,1361,7660,0,0,,,0,0,0,0
226,70,0,0,0,0,1,17,10,1523,2611,0,0,15460,90346,0,0,0,0
227,67,0,0,0,1,1,28,3,9728,6119,0,0,,,0,0,0,0
228,73,0,,,1,0,8,,8626,,0,0,,,,,,
229,73,1,1,1,1,1,9,1,2659,,0,0,,,,,0,0
230,68,1,1,1,1,1,16,5,4355,3327,0,0,220940,174720,0,0,0,0
231,75,0,0,0,1,1,0,0,,,0,0,427850,1891710,0,0,0,0
232,69,1,1,1,1,1,13,0,3921,,0,0,151930,197800,0,0,0,0
233,69,1,1,1,0,1,24,5,4881,6663,0,4,316980,476110,0,0,0,0
234,81,0,0,0,1,1,8,4,658,1866,0,0,292000,372360,,,0,0
235,82,1,1,1,0,1,9,7,4579,6186,0,4,507490,416060,0,0,0,0
237,77,1,1,1,1,1,0,5,,1836,0,0,273600,332210,0,0,0,0
238,73,0,0,0,0,1,0,3,,1219,0,0,93950,91750,0,0,0,0
239,86,0,0,0,1,1,23,6,7026,8920,0,0,1725390,237080,0,0,0,0
240,91,1,1,1,0,0,0,,,,3,0,,,1,0,1,0
241,84,1,0,0,1,0,0,,,,0,0,,,0,0,,
242,76,0,1,0,1,0,0,,,,0,0,549580,1010380,0,0,0,0
243,69,0,0,0,1,1,28,13,7205,7507,0,0,196810,114120,0,0,0,0
245,67,0,0,0,0,1,1,0,,,0,0,,,0,0,0,0
247,71,1,1,1,1,1,24,0,6773,,2,2,152890,165570,0,0,0,0
248,74,0,0,0,1,0,6,,,,0,0,,,,,0,0
249,69,0,0,0,1,1,0,0,,,0,0,299800,110670,1,0,0,0
250,72,1,1,1,1,0,20,,285,,0,0,,,0,0,0,0
251,80,1,1,1,0,0,9,,1978,,0,0,,,0,0,0,0
252,82,1,1,1,1,1,9,7,6007,6632,4,4,651570,696240,0,0,0,0
253,88,1,,,1,0,11,,4301,,1,0,,,,,,
254,65,0,0,0,1,1,17,2,7752,,0,0,,,0,0,0,0
255,78,1,1,1,1,0,16,,376,,1,0,,,,,,
256,78,1,1,1,1,1,16,6,2726,1326,6,4,,,0,0,,
257,71,1,1,1,0,1,10,4,3731,3752,0,0,,,0,0,0,0
258,79,1,1,1,1,1,13,8,4058,2168,2,0,,,0,0,0,0
259,79,0,0,0,1,0,0,,,,0,0,,,0,0,,
261,72,1,,,1,0,12,,13962,,3,0,,,,,,
262,70,1,1,0,1,1,30,0,3382,,0,0,,,0,0,0,0
265,76,1,1,1,0,1,13,7,738,685,2,4,,,0,0,0,0
266,73,0,0,0,0,1,13,8,2915,4791,0,0,,,0,0,0,0
267,69,1,1,1,0,1,0,8,,1348,0,0,746150,930310,1,1,0,1
268,71,1,1,1,1,1,27,3,4184,1514,0,0,700730,255600,0,0,0,0
269,78,1,1,1,1,1,24,5,1505,1291,0,6,134450,191190,0,0,0,0
271,87,0,0,0,1,0,14,,4918,,0,0,,,1,0,,
272,69,0,1,1,0,0,0,,,,0,0,,,0,0,0,0
273,72,1,1,1,1,1,4,5,,2079,0,0,,,0,0,0,0
274,76,0,0,0,1,1,0,0,,,0,0,1633034,1502970,0,0,0,0
275,72,0,0,0,1,0,24,,4638,,0,0,,,,,0,0
276,88,1,1,1,1,0,24,,6007,,9,0,,,0,0,,
277,74,1,1,1,0,0,17,,639,,0,0,,,0,0,,
279,75,1,1,1,0,0,4,,,,0,2,,,0,0,,
281,76,1,1,1,1,1,4,0,,,0,0,817420,604740,0,0,,0
282,69,1,1,0,1,1,0,5,,1634,1,0,73670,80820,0,0,0,0
283,72,1,1,1,1,1,11,0,3122,,0,0,,,0,0,0,0
284,70,1,1,1,0,1,0,0,,,2,4,,,0,0,0,0
286,71,1,1,1,1,0,11,,4890,,0,0,26360,6330,0,0,0,0
287,72,1,1,1,1,1,0,1,,,8,6,97610,74300,0,0,0,0
288,82,0,0,0,0,0,0,,,,0,0,,,0,0,,
290,67,0,0,0,0,1,0,1,,,0,0,,,0,0,0,0
292,79,1,1,1,0,0,14,,445,,5,2,1974270,1018810,0,0,0,1
293,82,1,1,1,1,1,20,4,3354,3450,0,0,409710,402570,0,0,0,0
294,65,1,1,1,0,0,19,,5624,,1,0,,,0,0,0,0
295,71,1,1,1,1,1,8,3,5143,2524,13,6,208150,193150,0,0,0,0
296,91,1,,,1,0,0,,,,8,0,,,,,,
297,66,1,1,0,1,1,7,6,11390,1531,0,0,,,0,0,0,0
298,70,1,1,1,1,1,20,0,4708,,6,6,,,,,0,0
299,74,0,0,0,1,0,17,,1908,,0,0,,,0,0,,
300,66,1,1,1,1,1,9,2,2467,,1,2,,,0,0,0,0
301,69,0,0,0,1,1,3,1,,,0,0,,,0,0,0,0
302,76,1,1,1,0,0,12,,2147,,7,2,,,0,0,,
303,68,1,1,1,1,1,14,2,13579,,0,0,,,0,0,0,0
305,89,1,1,1,1,0,14,,1373,,4,0,,,,,,1
306,85,0,0,0,1,0,0,,,,0,0,,,0,0,0,0
307,76,1,1,1,0,1,18,0,3472,,2,2,214740,212030,0,0,0,0
308,85,0,0,0,0,1,0,0,,,0,0,323910,350710,,,0,0
309,75,0,0,0,1,1,12,5,2898,851,0,0,487090,2044560,0,0,0,0
310,79,1,1,1,1,1,29,14,8936,5233,5,4,327410,249890,0,0,0,1
311,72,1,1,1,0,0,0,,,,5,2,,,0,0,0,0
312,69,0,0,0,1,1,22,11,8867,11724,0,0,324727,206520,0,0,0,0
313,75,1,,,1,0,4,,,,0,0,,,,,,
314,83,1,1,0,0,0,14,,2041,,0,0,,,,,0,0
315,67,1,1,1,0,1,3,0,,,0,0,245450,133810,0,0,0,0
316,67,0,0,0,1,0,0,,,,0,0,,,0,0,0,0
317,79,0,,,1,0,11,,3530,,0,0,,,0,0,,
318,74,0,0,0,1,1,27,13,7248,7351,0,0,,,,,0,0
319,83,0,0,0,1,0,0,,,,0,0,,,,,,
320,74,0,0,0,0,1,11,2,1341,,0,0,904510,317530,0,0,0,0
322,82,0,0,0,1,0,0,,,,0,0,,,,,,
324,83,1,1,1,0,0,5,,,,1,2,,,,,,
325,69,1,1,1,1,1,26,9,9351,10848,0,0,,,0,0,0,0
326,69,1,1,1,1,1,21,11,11006,8544,3,4,124570,117410,0,0,0,0
327,67,1,1,1,1,1,15,0,16519,,0,0,,,0,0,0,0
328,68,1,1,1,0,1,20,9,2204,2161,3,6,155820,99090,0,0,0,0
329,68,1,1,1,0,0,0,,,,0,2,,,0,0,,
330,80,1,1,1,1,0,27,,12220,,1,0,,,0,0,0,0
331,76,1,1,1,1,1,18,7,4245,3515,0,0,117690,139700,0,0,0,0
332,65,0,0,0,0,1,12,1,4458,,0,0,67680,21670,0,,0,0
333,68,0,0,0,0,1,11,4,1186,2109,0,0,204135,169780,0,0,0,0
334,83,0,1,1,0,0,6,,,,0,0,,,0,0,,
335,73,1,1,0,1,1,0,0,,,0,0,298350,281270,0,0,0,0
336,65,0,0,0,0,0,0,,,,0,0,,,0,0,0,0
337,65,1,1,1,1,1,0,1,,,0,0,,,0,0,0,0
338,80,1,1,1,1,0,7,,772,,0,6,219620,3085260,,,1,0
339,68,0,0,0,0,1,0,3,,3590,0,0,,,0,0,0,0
340,81,0,0,0,1,0,10,,2815,,0,0,,,0,0,,
341,68,0,0,0,0,0,14,,6244,,0,0,,,0,0,0,0
342,76,1,1,1,0,0,0,,,,0,2,,,0,0,0,0
343,80,1,1,1,1,0,2,,,,0,0,,,0,0,,
345,67,0,0,0,1,0,14,,5768,,0,0,,,0,0,,
346,75,1,,,0,0,20,,9910,,11,0,,,0,0,,
347,68,1,1,0,1,0,26,,3045,,0,0,,,0,0,0,0
348,78,1,1,1,0,0,0,,,,8,0,,,1,1,,
349,84,1,,,1,0,0,,,,1,0,,,0,0,,
350,74,0,0,0,1,1,1,1,,,0,0,184800,143920,0,0,0,0
351,76,1,,,1,0,0,,,,3,0,,,,,,
352,69,0,0,0,0,0,25,,1019,,0,0,60000,568860,0,0,0,0
353,74,1,1,1,1,1,10,6,6126,10133,0,0,,,0,0,0,0
354,82,1,1,1,1,1,19,12,1879,823,1,0,265950,269440,0,0,0,0
355,69,1,1,1,0,0,14,,6215,,0,0,,,0,0,,
356,82,1,1,1,1,1,15,13,1269,1045,1,0,396890,377070,0,0,0,0
357,69,1,1,0,1,0,13,,1848,,0,0,,,,,0,0
358,79,1,0,1,1,0,0,,,,0,0,,,0,0,0,0
360,73,1,1,1,1,1,9,3,3514,4554,0,0,411800,2101090,0,0,0,0
362,80,1,1,1,0,1,14,7,5645,5047,2,0,185800,158820,0,0,0,1
363,83,1,1,1,1,1,22,0,1346,,4,4,910720,1201650,1,0,1,0
364,80,1,1,1,1,0,18,,2707,,0,0,2606650,2376500,0,0,0,0
367,75,0,0,0,1,1,0,11,,4965,0,0,24210,21520,,,0,0
369,74,1,1,1,1,1,0,7,,5299,1,2,,,0,0,0,0
370,84,1,1,1,0,1,17,5,5197,5070,5,4,143610,193520,0,0,0,1
371,77,0,0,0,0,0,0,,,,0,0,,,0,1,,
372,70,0,0,0,1,0,19,,3340,,0,0,,,,,,
374,79,1,1,1,0,1,14,4,8496,7851,0,2,1906790,640620,,,0,0
375,76,1,1,1,1,0,5,,,,0,2,,,0,0,,
376,68,0,,,1,0,11,,4622,,0,0,,,0,0,,
377,69,0,,,0,0,12,,7530,,0,0,,,,,,
378,68,0,0,0,1,1,26,13,22703,23486,0,0,,,0,0,0,0
379,67,0,0,0,1,1,2,6,,1989,0,0,91410,199980,0,0,0,0
380,78,0,0,0,1,1,19,5,1529,2977,0,0,86030,117020,0,0,0,0
381,67,1,1,1,0,1,16,8,3418,2140,2,0,178540,294970,0,0,0,0
382,72,0,0,0,1,0,12,,4464,,0,0,,,,,,
383,73,0,0,0,0,0,4,,,,0,0,,,0,0,,
384,69,1,0,0,1,0,11,,3386,,0,0,,,,,,
385,69,0,0,0,1,0,23,,3392,,0,0,,,0,0,0,0
386,67,0,0,0,0,0,9,,981,,0,0,,,0,0,,
387,73,0,0,0,0,0,21,,1896,,0,0,,,0,0,,
389,72,1,1,0,1,0,0,,,,0,0,,,0,0,,
391,75,1,1,1,0,0,1,,,,0,2,,,0,0,0,0
392,73,1,1,1,0,1,1,4,,7564,0,2,,,0,0,0,0
394,82,1,0,0,1,1,9,8,1713,1112,0,0,411270,365350,0,0,0,0
396,66,0,0,0,1,1,17,13,3126,274,0,0,191870,247600,,,0,0
397,77,0,1,1,0,0,14,,4949,,0,4,,,0,0,,
398,80,1,1,1,1,1,12,8,2435,1067,2,0,1016500,958080,0,0,0,0
399,67,1,1,1,1,1,25,10,4429,2711,1,2,,,0,0,0,0
400,76,1,,,1,0,9,,4316,,1,0,,,,,,
402,73,0,0,0,0,1,2,2,,,0,0,133370,235100,0,0,0,0
403,70,1,1,1,0,1,4,5,,2784,2,6,88350,68040,0,0,0,0
405,76,0,0,0,1,1,22,9,5476,9062,0,0,,,0,0,0,0
406,84,0,0,0,0,0,21,,326,,0,0,,,1,1,,
407,69,0,0,0,1,1,9,0,3098,,0,0,,,,,0,0
409,69,0,0,0,1,0,0,,,,0,0,,,,,,
410,67,1,1,1,1,1,16,5,8163,6603,1,0,,,0,0,0,0
411,74,0,0,0,0,1,5,6,,3437,0,0,140620,529550,0,1,1,1
412,74,0,0,0,1,1,3,3,,5210,0,0,280790,336510,0,0,0,0
413,71,0,0,0,1,0,19,,10457,,0,0,,,0,0,,
414,72,0,0,0,1,1,20,5,1005,827,0,0,1559920,1688600,0,0,0,0
415,73,0,0,0,1,1,0,10,,8205,0,0,18230,102600,0,0,0,0
416,79,1,1,0,1,0,0,,,,1,0,,,,,,
417,65,0,0,0,1,0,16,,4449,,0,0,,,0,0,,
418,69,1,1,1,1,1,0,1,,,1,2,77400,721530,0,0,0,0
419,73,0,0,0,1,1,25,2,4422,,0,0,9020,0,0,0,0,0
420,84,1,1,1,0,0,0,,,,1,0,,,0,0,,1
421,80,0,0,0,0,1,0,7,,1130,0,0,250430,595980,0,0,0,0
424,65,0,0,0,0,0,2,,,,0,0,,,0,,,
425,69,1,1,1,1,1,26,14,11470,12280,1,2,175850,194760,0,0,0,0
426,73,0,0,0,1,1,4,0,,,0,0,,,0,0,0,0
427,71,1,1,1,0,1,0,7,,829,0,0,,,0,0,0,0
428,74,0,0,0,1,0,14,,1070,,0,0,,,,,,
429,69,0,0,0,1,0,0,,,,0,0,,,,0,,
430,75,0,0,0,0,0,15,,3565,,0,0,,,,,0,1
432,80,1,,,0,0,13,,5495,,20,0,,,,,,
433,76,1,,,0,0,0,,,,9,0,,,,,,
434,81,1,1,0,0,0,22,,859,,0,0,,,0,0,0,1
435,73,1,1,1,1,1,15,0,3283,,0,0,183550,761000,0,0,0,0
436,67,1,1,1,1,1,5,3,,479,0,0,238440,127510,0,0,0,0
437,72,0,0,0,1,0,25,,9081,,0,0,,,0,0,,
438,84,1,1,1,1,1,0,5,,4385,1,10,162200,338800,0,0,0,0
439,73,1,1,1,1,1,15,4,4644,3097,0,0,263950,314710,0,0,0,0
440,75,0,1,1,0,1,14,9,1866,1965,0,2,0,0,,,0,0
441,79,1,1,1,0,1,9,0,1320,,0,0,582220,527740,1,1,1,1
442,74,0,0,0,0,0,0,,,,0,0,,,,,0,0
443,65,1,1,1,1,1,19,2,2429,,0,0,653440,565870,0,0,0,0
444,71,0,1,1,0,0,16,,1525,,0,4,,,,,,
445,73,1,1,1,0,1,25,0,2607,,3,2,235512,133414,0,0,0,0
446,76,1,1,1,0,0,4,,,,1,0,,,1,1,,
447,66,1,1,0,1,1,24,0,3101,,0,0,99480,89340,0,0,0,0
448,66,0,0,0,0,1,19,3,1005,1095,0,0,349360,3106740,0,0,0,0
449,78,1,1,1,1,1,12,2,2521,,0,6,347900,299890,0,0,1,1
450,84,1,1,1,1,1,0,12,,2493,1,0,4769210,5344020,0,0,0,0
451,69,1,1,1,1,1,9,9,4168,1898,2,2,,,0,0,0,0
452,69,1,1,1,1,0,10,,3587,,0,0,,,0,0,,
453,67,1,1,1,1,1,0,0,,,6,8,140030,122170,0,0,0,0
454,65,0,0,0,1,1,4,2,,,0,0,,,0,0,0,0
455,75,1,1,1,1,1,27,6,1577,10134,1,4,469980,360670,0,0,0,0
456,76,1,1,1,1,1,6,2,,,8,10,507000,702470,0,0,0,0
457,77,0,0,0,1,0,0,,,,0,0,,,0,,0,0
458,65,0,,,1,0,29,,1935,,0,0,,,0,0,,
459,76,0,0,0,0,1,21,14,5946,7184,0,0,67590,178860,0,0,0,0
460,78,0,0,0,0,1,12,5,1790,3836,0,0,143950,623750,0,0,0,0
461,65,0,0,1,0,1,9,0,2436,,0,8,4096010,171510,0,0,0,0
462,73,0,,,1,0,12,,5407,,0,0,,,0,0,,
464,74,1,1,1,1,1,22,5,2470,3752,9,4,202280,237580,,,0,0
465,82,1,1,0,0,0,19,,2311,,3,0,144090,429610,0,0,1,0
466,77,0,0,0,1,1,28,6,12385,12167,0,0,229480,57800,0,0,0,0
467,86,1,1,1,0,0,5,,,,0,0,,,0,0,,
468,77,0,0,0,1,1,27,12,4199,7483,0,0,291760,507840,0,0,0,0
469,74,1,1,1,1,0,21,,1792,,16,4,,,0,0,,
470,67,1,1,1,1,1,15,9,4901,2741,8,22,,,,,0,0
471,74,0,0,0,0,1,1,5,,2816,0,0,197660,138780,0,0,0,1
472,76,1,1,1,0,0,14,,3170,,1,6,115240,92930,0,0,0,0
473,74,1,1,1,1,1,24,6,15340,15461,1,2,25710,20530,0,0,0,0
474,83,1,,,0,0,12,,2240,,0,0,,,,,,
475,75,0,0,0,1,1,11,6,1925,3075,0,0,163880,144790,0,0,0,0
476,75,1,,,1,0,12,,7251,,0,0,,,0,0,,
478,68,0,0,0,1,1,24,0,7350,,0,0,,,0,0,0,0
479,85,1,1,1,1,1,12,4,6560,3533,2,4,406770,324340,0,0,0,0
480,73,1,1,1,1,1,0,6,,5729,1,0,81040,84760,0,0,0,0
481,68,1,1,0,1,1,8,4,7761,10292,0,0,,,,,0,0
482,72,0,0,0,1,1,8,1,2958,,0,0,,,0,0,0,0
484,70,0,0,0,1,1,6,1,,,0,0,101290,80700,0,0,0,0
485,76,0,0,0,1,0,0,,,,0,0,,,0,0,,
486,69,1,1,1,1,1,11,6,12914,8380,0,0,2402610,224160,0,0,0,0
487,66,0,0,0,0,1,9,2,2675,,0,0,48700,150490,0,0,0,0
488,82,1,1,1,1,0,15,,9024,,1,0,,,0,0,0,1
491,69,1,1,1,0,0,0,,,,4,2,,,0,0,,
492,73,1,1,0,1,0,15,,1515,,0,0,,,,,,
493,72,0,1,1,0,1,29,14,9977,9394,0,0,260690,185350,,0,0,0
494,65,0,0,0,1,1,10,9,1240,1033,0,0,,,,,0,0
495,68,1,1,1,1,1,21,0,8588,,1,0,215000,146440,,,0,0
496,66,0,0,0,1,1,3,7,,5771,0,0,,,0,0,0,0
497,67,0,0,0,1,0,5,,,,0,0,,,,,,
498,67,0,0,0,1,1,0,0,,,0,0,,,,,0,0
499,68,0,0,0,1,0,19,,2467,,0,0,,,0,0,,
500,71,0,0,0,1,1,2,2,,,0,0,325820,3553425,0,0,0,0
501,77,1,1,1,1,1,20,8,3114,2459,1,0,593650,469290,0,0,0,0
502,78,1,1,0,0,0,2,,,,0,0,,,0,0,0,0
503,74,0,0,0,1,1,0,7,,2022,0,0,201070,115510,,,0,0
505,75,1,1,1,1,0,0,,,,1,0,,,0,0,0,1
506,68,0,0,0,1,1,14,0,8538,,0,0,115930,68310,,,0,0
508,74,1,1,1,1,1,16,8,1621,2095,0,0,516920,3060330,0,0,0,0
509,79,1,1,0,1,1,14,0,5344,,7,0,511920,824610,0,1,0,1
510,68,0,1,1,1,1,3,11,,4344,0,0,,,,,0,0
511,75,0,0,0,1,0,10,,3734,,0,0,,,,,0,0
512,77,1,1,1,1,0,17,,3901,,2,2,,,0,0,0,0
513,75,0,0,0,1,0,2,,,,0,0,,,,,1,1
515,85,0,0,0,0,1,22,0,192,,0,0,1370750,1292410,1,1,1,1
516,80,0,0,0,1,0,27,,523,,0,0,,,,0,,
517,68,0,0,0,0,0,14,,4274,,0,0,,,0,0,0,0
518,73,1,1,1,1,1,21,9,13393,14191,1,2,85030,180240,,,0,0
519,73,1,,,1,0,16,,5077,,1,0,,,0,0,,
520,80,0,0,0,1,1,23,0,5709,,0,0,110310,90330,0,0,0,0
521,74,1,1,0,0,0,6,,,,0,0,835970,218790,0,0,0,0
522,86,1,1,1,1,1,27,10,3918,304,1,0,262110,741260,0,0,0,0
523,66,1,1,1,0,1,0,2,,,0,0,92360,113680,0,0,0,0
524,69,1,1,1,0,0,1,,,,5,2,,,0,0,,
525,74,0,0,0,1,1,4,0,,,0,0,81490,71990,0,0,0,0
526,75,1,1,1,0,1,0,10,,7819,2,4,130710,198010,0,0,0,0
527,74,1,1,1,0,1,13,4,1502,2522,0,0,,,,0,0,0
528,65,1,1,1,0,1,31,0,4907,,0,0,67820,57610,,,0,0
529,68,0,1,0,0,1,26,14,4662,1129,0,0,,,0,0,0,0
530,77,0,0,0,1,1,0,0,,,0,0,437040,440180,0,0,0,0
531,74,0,0,0,0,0,6,,,,0,0,,,0,,,
532,68,0,0,0,0,0,0,,,,0,0,,,,,1,0
533,72,0,0,0,1,0,25,,1209,,0,0,235270,246860,0,0,0,0
534,72,1,1,1,1,1,1,10,,8545,1,0,387650,537620,0,0,0,0
535,68,1,1,1,0,0,1,,,,3,0,,,,,0,0
536,71,0,0,0,1,1,3,0,,,0,0,327060,435190,0,0,0,0
537,69,0,0,0,0,1,0,3,,1056,0,0,5770,0,0,0,0,0
538,66,1,1,1,0,0,5,,,,4,8,,,,0,,
539,68,1,1,1,1,1,20,10,5735,5368,0,2,,,0,0,0,0
541,65,0,0,0,1,0,0,,,,0,0,,,0,0,0,0
542,65,1,1,1,0,1,20,8,1197,895,0,0,,,0,0,0,0
543,83,0,0,0,1,1,0,15,,227,0,0,302770,260820,0,0,0,0
545,69,1,1,1,0,0,17,,6013,,2,4,,,0,0,0,0
546,66,0,0,0,1,1,25,9,7807,5891,0,0,,,0,0,0,0
547,83,1,1,1,1,0,2,,,,5,0,315650,653950,0,0,,
550,67,0,0,0,0,0,0,,,,0,0,,,0,0,0,0
551,69,0,0,0,1,1,0,3,,1336,0,0,,,0,0,0,0
552,77,1,1,1,1,1,29,11,10357,10673,10,10,396930,322540,,,0,0
553,69,1,1,1,1,1,6,7,,14711,0,0,197540,191310,,,0,0
554,68,1,1,1,1,0,28,,3540,,1,0,,,0,0,,
555,92,0,0,0,0,0,0,,,,0,0,,,,,,
556,79,0,0,0,1,1,0,4,,855,0,0,290172,423340,0,0,0,0
558,76,1,1,1,0,0,0,,,,16,2,367280,320830,,,0,0
559,74,0,0,0,1,1,16,4,3060,2193,0,0,,,1,0,0,0
560,71,1,1,1,0,1,6,0,,,2,0,220370,219980,0,0,0,0
561,69,1,1,1,1,0,4,,,,0,0,,,,,,
562,87,0,0,0,1,0,9,,2493,,0,0,281370,316620,0,0,0,0
563,75,1,1,1,1,1,1,2,,,0,0,222680,273120,0,0,0,0
564,86,0,,,1,0,0,,,,0,0,,,,,,
565,74,0,0,0,1,1,16,5,3564,9889,0,0,408970,552150,0,0,0,0
566,76,1,1,1,0,1,20,5,1467,1310,3,2,247240,300950,0,0,0,0
569,72,0,,,1,0,0,,,,0,0,,,0,0,,
570,68,1,1,1,1,1,29,12,1831,1179,5,0,94570,89550,0,0,0,0
571,67,1,1,1,0,1,1,0,,,7,14,191470,80140,0,0,0,0
572,75,1,1,1,1,1,11,12,8049,8179,4,6,488670,399790,,,0,0
573,65,1,1,1,1,1,7,0,3373,,0,0,,,,,0,0
574,67,0,0,0,1,1,8,0,610,,0,0,611325,482165,0,0,1,0
575,77,0,0,0,0,0,17,,1306,,0,0,,,,,,
576,74,1,1,1,1,1,17,6,871,1353,0,2,,,,,0,0
577,75,0,0,0,0,0,15,,1273,,0,0,,,0,0,,
578,86,0,0,0,0,0,11,,119,,0,0,,,1,1,1,1
579,74,1,1,1,0,1,15,3,2178,4993,1,0,,,0,0,0,0
581,73,0,0,0,1,1,0,3,,1438,0,0,282370,314010,0,0,0,0
582,75,1,1,1,1,0,0,,,,1,0,1550452,2109710,0,0,0,0
583,71,1,1,0,1,0,14,,2291,,0,0,,,0,0,0,0
584,67,0,0,0,0,1,14,5,2226,1664,0,0,,,0,0,0,0
586,77,1,1,1,0,0,13,,2531,,5,2,,,0,0,,
587,82,0,0,0,1,0,0,,,,0,0,,,0,0,0,0
588,72,1,1,1,1,1,18,0,6970,,2,0,101280,86590,0,0,0,0
589,76,0,0,0,1,1,20,3,1542,958,0,0,175840,203470,0,0,0,0
590,77,1,1,1,0,1,17,6,1167,1212,2,0,,,0,0,,0
591,71,1,,,0,0,0,,,,10,0,,,,,,
592,79,1,1,1,1,1,11,12,1886,6626,1,2,521390,537140,0,0,0,0